{"text_format":"3","workbook":"xlsx","n_sheets":6,"sheets":["Рейтинг 1 гр","Рейтинг 2 гр","Рейтинг 3 гр","Рейтинг 4 гр","V гр","рейтинг 5 гр"],"not_rendered":{"macros":1,"defined_names":8},"read":"whole","date_system":"1900"}

{"sheet":"Рейтинг 1 гр","index":0,"n_rows":19,"n_cols":5,"rows_kept":19}
[{"$nulls":4},"Листы [таблица] и [Рейтинг] не переименовывать\nиначе собьются связи в формулах на листе рейтинга. Категорически ЗАПРЕЩЕНО изменять фильтр."]
["Место в рейтинге","Наименование учреждения здравоохранения","величина комплексного индекса"]
[1,"Пошехонский МР ГУЗ ЯО \"Пошехонская ЦРБ\"",{"v":1.1947420480100717,"d":"1.19"}]
[2,"Любимский МР ГБУЗ ЯО \"Любимская ЦРБ\"",{"v":1.0921064720375087,"d":"1.09"}]
[3,"Тутаевский МР ГУЗ ЯО \"Тутаевская ЦРБ\"",{"v":1.0686352832103125,"d":"1.07"}]
[4,"Мышкинский МР ГУЗ ЯО \"ЦРБ им. Д.Л. Соколова\"",{"v":1.0294382334083536,"d":"1.03"}]
[5,"Некоузский МР ГУЗ ЯО \"Некоузская ЦРБ\"",{"v":1.0183323699076448,"d":"1.02"}]
[6,"Некрасовский МР ГБУЗ ЯО \"Некрасовская ЦРБ\"",{"v":1.0129172211605912,"d":"1.01"}]
[7,"Борисоглебский МР ГБУЗ ЯО \"Борисоглебская ЦРБ\"",{"v":0.9992337502317492,"d":"1.00"}]
[8,"Переславский МР ГУЗ ЯО \"Переславская ЦРБ\"",{"v":0.9953208369252389,"d":"1.00"}]
[9,"Брейтовский МР ГУЗ ЯО \"Брейтовская ЦРБ\"",{"v":0.948654509508919,"d":"0.95"}]
[10,"Первомайский МР ГУЗ ЯО \"Пречистенская ЦРБ\"",{"v":0.9358059521795591,"d":"0.94"}]
[11,"Ярославский МР ГУЗ ЯО \"Ярославская ЦРБ\"",{"v":0.9302359406974208,"d":"0.93"}]
[12,"Гаврилов-Ямский МР ГУЗ ЯО \"Гаврилов-Ямская ЦРБ\"",{"v":0.9246311203120307,"d":"0.92"}]
[13,"Ростовский МР ГУЗ ЯО \"Ростовская ЦРБ\"",{"v":0.9131968899949542,"d":"0.91"}]
[14,"Даниловский МР ГБУЗ ЯО \"Даниловская ЦРБ\"",{"v":0.9131327407306121,"d":"0.91"}]
[15,"Большесельский МР ГУЗ ЯО \"Большесельская ЦРБ\"",{"v":0.8752334676851766,"d":"0.88"}]
[16,"Некрасовский МР ГУЗ ЯО \"Бурмакинская районная больница № 1\"",{"v":0.87160881951838,"d":"0.87"}]
[17,"Угличский МР ГУЗ ЯО \"Угличская ЦРБ\"",{"v":0.8451531963527092,"d":"0.85"}]

{"sheet":"Рейтинг 2 гр","index":1,"n_rows":19,"n_cols":5,"rows_kept":19}
[{"$nulls":4},"Листы [таблица] и [Рейтинг] не переименовывать\nиначе собьются связи в формулах на листе рейтинга. Категорически ЗАПРЕЩЕНО изменять фильтр."]
["Место в рейтинге","Наименование учреждения здравоохранения","величина комплексного индекса"]
[1,"г. Ярославль ГУЗ ЯО \"Клиническая больница № 5\"",{"v":1.1554532147009957,"d":"1.16"}]
[2,"г. Рыбинск ГУЗ ЯО \"Городская больница № 2 им. Н.И. Пирогова\"",{"v":1.1526901710969146,"d":"1.15"}]
[3,"г. Ярославль ГУЗ ЯО \"Клиническая больница СМП имени Н.В. Соловьева\"",{"v":1.0371473976204515,"d":"1.04"}]
[4,"г. Ярославль ГУЗ ЯО \"Клиническая больница № 10\" (ГКУЗ ЯО МСЧ НЯ НПЗ)",{"v":1.025791586858506,"d":"1.03"}]
[5,"г. Ярославль ГУЗ ЯО \"Городская больница № 7\"",{"v":0.9824703116886835,"d":"0.98"}]
[6,"г. Рыбинск ГУЗ ЯО \"Городская больница № 6\"",{"v":0.9544632886112349,"d":"0.95"}]
[7,"г. Ярославль ГУЗ ЯО \"Клиническая больница № 2\"",{"v":0.9450176093360828,"d":"0.95"}]
[8,"г. Рыбинск ГУЗ ЯО \"Городская детская больница\"",{"v":0.9345069343807291,"d":"0.93"}]
[9,"г. Ярославль ГУЗ ЯО \"Клиническая больница № 9\"",{"v":0.9326673582196199,"d":"0.93"}]
[10,"г. Ярославль ГУЗ ЯО \"Клиническая больница № 1\" (ГУЗ ЯО МСЧ ОАО \"Ярославский шинный завод\")",{"v":0.9048658268335588,"d":"0.90"}]
[11,"г. Рыбинск ГУЗ ЯО \"Городская больница № 1\"",{"v":0.86644357524596,"d":"0.87"}]
[12,"г. Ярославль ГУЗ ЯО \"Детская клиническая больница № 1\"",{"v":0.859643127641993,"d":"0.86"}]
[13,"г. Ярославль ГБУЗ ЯО \"Городская больница им. Н.А. Семашко\"",{"v":0.8391397993747065,"d":"0.84"}]
[14,"г. Ярославль ГУЗ ЯО \"Клиническая больница № 8\"",{"v":0.835054238120775,"d":"0.84"}]
[15,"г. Рыбинск ГУЗ ЯО \"Городская больница № 4\"",{"v":0.8171997480527288,"d":"0.82"}]
[16,"г. Ярославль ГУЗ ЯО \"Клиническая больница № 3\" (ГКУЗ ЯО МСЧ ЯЗДА)",{"v":0.7822987619762342,"d":"0.78"}]
[17,"г. Рыбинск ГУЗ ЯО \"Городская больница № 3\"",{"v":0.7215062637033225,"d":"0.72"}]

{"sheet":"Рейтинг 3 гр","index":2,"n_rows":12,"n_cols":5,"rows_kept":12}
[{"$nulls":4},"Листы [таблица] и [Рейтинг] не переименовывать\nиначе собьются связи в формулах на листе рейтинга. Категорически ЗАПРЕЩЕНО изменять фильтр."]
["Место в рейтинге","Наименование учреждения здравоохранения","величина комплексного индекса"]
[1,"г. Ярославль ГУЗ ЯО \"Стоматологическая поликлиника № 3\"",{"v":1.0434225210253187,"d":"1.04"}]
[2,"г. Ярославль ГУЗ ЯО \"Детская поликлиника № 5\"",{"v":1.0204836660191663,"d":"1.02"}]
[3,"г. Ярославль ГБКУЗ ЯО \"Поликлиника № 2\"",{"v":1.016547610573531,"d":"1.02"}]
[4,"г. Ярославль ГБУЗ ЯО \"Областная стоматологическая поликлиника\"",{"v":0.9870254776314076,"d":"0.99"}]
[5,"г. Ярославль ГУЗ ЯО \"Детская поликлиника № 3\"",{"v":0.9053237564247307,"d":"0.91"}]
[6,"г. Рыбинск ГУЗ ЯО \"Городская поликлиника № 3 им. Н.А. Семашко\"",{"v":0.9021974532137692,"d":"0.90"}]
[7,"г. Ярославль ГУЗ ЯО \"Детская стоматологическая поликлиника  № 2\"",{"v":0.8696790930915046,"d":"0.87"}]
[8,"г. Рыбинск ГУЗ ЯО \"Городская поликлиника № 1\"",{"v":0.8689737071911788,"d":"0.87"}]
[9,"Рыбинский МР ГУЗ ЯО \"Рыбинская ЦРП\"",{"v":0.8650079710285238,"d":"0.87"}]
[10,"г. Рыбинск ГУЗ ЯО \"Рыбинская стоматологическая поликлиника\"",{"v":0.8349045841906604,"d":"0.83"}]

{"sheet":"Рейтинг 4 гр","index":3,"n_rows":16,"n_cols":5,"rows_kept":16}
[{"$nulls":4},"Листы [таблица] и [Рейтинг] не переименовывать\nиначе собьются связи в формулах на листе рейтинга. Категорически ЗАПРЕЩЕНО изменять фильтр."]
["Место в рейтинге","Наименование учреждения здравоохранения","величина комплексного индекса"]
[1,"г. Ярославль ГБУЗ ЯО \"ЯОКГВВ-МЦ \"Здоровое долголетие\"",{"v":1.3514601504406318,"d":"1.35"}]
[2,"г. Ярославль ГБУЗ ЯО \"Областная клиническая онкологическая больница\"",{"v":1.1902872954011912,"d":"1.19"}]
[3,"г. Ярославль ГБУЗ ЯО \"Областной перинатальный центр\"",{"v":1.1118147118349941,"d":"1.11"}]
[4,"г. Ярославль ГБУЗ ЯО \"Ярославская областная клиническая наркологическая больница\"",{"v":0.9976825017508112,"d":"1.00"}]
[5,"г. Ярославль ГБУЗ ЯО \"Областная детская клиническая больница\"",{"v":0.9772521853183612,"d":"0.98"}]
[6,"г. Ярославль ГБУЗ ЯО \"Областной кожно-венерологический диспансер\"",{"v":0.9616134884046005,"d":"0.96"}]
[7,"г. Ярославль ГУЗ ЯО \"Центр СПИД\"",{"v":0.9499336605035013,"d":"0.95"}]
[8,"г. Ярославль ГУЗ ЯО \"Инфекционная клиническая больница № 1\"",{"v":0.9211393999876246,"d":"0.92"}]
[9,"г. Ярославль ГБУЗ ЯО \"Ярославская областная клиническая психиатрическая больница\"",{"v":0.9009856025311657,"d":"0.90"}]
[10,"г. Рыбинск ГКУЗ ЯО \"Рыбинская психиатрическая больница\"",{"v":0.8855645719880347,"d":"0.89"}]
[11,"г. Ярославль ГБУЗ ЯО \"Областная клиническая больница\"",{"v":0.814059753621809,"d":"0.81"}]
[12,"г. Ярославль ГБУЗ ЯО \"Областная клиническая туберкулезная больница\"",{"v":0.7358478070171328,"d":"0.74"}]
[13,"г. Ярославль ГБУЗ ЯО \"Областной врачебно-физкультурный диспансер\"",{"v":0.6992037489204325,"d":"0.70"}]
[14,"г. Рыбинск ГКУЗ ЯО \"Рыбинский противотуберкулезный диспансер\"",{"v":0.6648394222912825,"d":"0.66"}]

{"sheet":"V гр","index":4,"n_rows":11,"n_cols":60,"rows_kept":11,"hidden":true,"merged":[[0,0,1,0],[0,1,0,3],[0,4,0,6],[0,7,0,9],[0,10,0,12],[0,13,0,15],[0,16,0,18],[0,19,0,21],[0,22,0,24],[0,25,0,27],[0,28,0,30],[0,31,0,33],[0,34,0,36],[0,37,0,39],[0,40,0,42],[0,43,0,45],[0,46,0,48],[0,49,0,51],[0,52,0,54],[0,55,0,57]]}
["Наименование учреждения здравоохранения","Уровень укомплектованности штатных должностей врачами, в %",null,null,"Уровень укомплектованности штатных должностей средним медперсоналом, в %",null,null,"Коэффициент совместительства врачей",null,null,"Коэффициент совместительства среднего медперсонала",null,null,"Удельный вес врачей, имеющих первую и высшую  квалификационные категории, в %",null,null,"Удельный вес средних медработников, имеющих первую и высшую квалификационные категории, в %.",null,null,"Фондооснащенность (в руб. на кв. м)",null,null,"Фондовооруженность (в руб. на 1 врача)",null,null,"стационарная медицинская помощь, койко-дни  в %  к плану",null,null,"дневные стационары всех типов, пациенто-дни  в %  к плану",null,null,"амбулаторно-поликлиническая помощь, посещения в % к плану",null,null,"скорая медицинская помощь, вызовы  в %  к плану",null,null,"Индекс оценки доступности и  удовлетворенности  качеством оказываемой  медицинской помощи  ",null,null,"Индекс дефектов объемов, сроков, качества и условий предоставления медицинской помощи по обязательному медицинскому страхованию",null,null,"Внутрибольничная летальность",null,null,"Среднее число дней работы койки в году",null,null,"Число (процент) осложнений после проведенных операций",null,null,"Выполнение функции врачебной должности (число посещений на 1 врача в год)",null,null,"Количество внеплановых проверок медицинских организаций в ходе которых были выявлены нарушения в неоказании, несвоевременном оказании, либо оказании медицинской помощи ненадлежащего качества",null,null,"величина комплексного индекса","Место в рейтинге"]
[null,"пок-ль ЛПУ","норматив","индекс","пок-ль ЛПУ","норматив","индекс","пок-ль ЛПУ","норматив","обратн. индекс","пок-ль ЛПУ","норматив","обратн. индекс","пок-ль ЛПУ","средний по области","индекс","пок-ль ЛПУ","средний по области"," индекс","пок-ль ЛПУ","средний по области"," индекс","пок-ль ЛПУ","средний по области"," индекс","пок-ль ЛПУ","норматив","индекс","пок-ль ЛПУ","норматив","индекс","пок-ль ЛПУ","норматив","индекс","пок-ль ЛПУ","норматив","индекс","пок-ль ЛПУ","средний по области"," индекс","пок-ль ЛПУ","средний по области","обратн. индекс","пок-ль ЛПУ","средний по области","индекс","пок-ль ЛПУ","средний по области","индекс","пок-ль ЛПУ","средний по области","индекс","пок-ль ЛПУ","средний по группе","индекс","пок-ль ЛПУ","норматив","индекс"]
["тест",1,100,{"$f":"IF(IFERROR(B3/C3,FALSE),B3/C3,\" \")","v":0.01},1,100,{"$f":"IF(IFERROR(E3/F3,FALSE),E3/F3,\" \")","v":0.01},1,1,{"$f":"IF(IFERROR(I3/H3,FALSE),I3/H3,\" \")","v":1},1,1,{"$f":"IF(IFERROR(L3/K3,FALSE),L3/K3,\" \")","v":1},1,53.1,{"$f":"IF(IFERROR(N3/O3,FALSE),N3/O3,\" \")","v":0.018832391713747645},1,{"v":67.3,"d":"67.30"},{"$f":"IF(IFERROR(Q3/R3,FALSE),Q3/R3,\" \")","v":0.01485884101040119},1,20012.2,{"$f":"IF(IFERROR(T3/U3,FALSE),T3/U3,\" \")","v":4.9969518593657867E-5},1,3011855,{"$f":"IF(IFERROR(W3/X3,FALSE),W3/X3,\" \")","v":3.3202129584591557E-7},1,100,{"$f":"IF(IFERROR(AA3/Z3,FALSE),AA3/Z3,\" \")","v":100},1,100,{"$f":"IF(IFERROR(AC3/AD3,FALSE),AC3/AD3,\" \")","v":0.01},1,100,{"$f":"IF(IFERROR(AF3/AG3,FALSE),AF3/AG3,\" \")","v":0.01},1,100,{"$f":"IF(IFERROR(AJ3/AI3,FALSE),AJ3/AI3,\" \")","v":100},1,0.4502797,{"$f":"IF(IFERROR(AL3/AM3,FALSE),AL3/AM3,\" \")","v":2.2208418456350576},1,0.1095192,{"$f":"IF(IFERROR(AP3/AO3,FALSE),AP3/AO3,\" \")","v":0.1095192},10,2.2,{"$f":"IF(IFERROR(AS3/AR3,FALSE),AS3/AR3,\" \")","v":0.22000000000000003},1,309.5,{"$f":"IF(IFERROR(AU3/AV3,FALSE),AU3/AV3,\" \")","v":3.2310177705977385E-3},1,1.1,{"$f":"IF(AX3<>\"\",IF(IFERROR(AY3/AX3,FALSE),AY3/AX3,1),\"\")","v":1.1},1,{"v":2789.2,"d":"2789"},{"$f":"IF(IFERROR(BA3/BB3,FALSE),BA3/BB3,\" \")","v":3.5852574214828629E-4},1,1,{"$f":"IFERROR(BE3-0.25*BD3,\"\")","v":0.75},{"$f":"SUM(D3,G3,J3,M3,P3,S3,V3,Y3,AB3,AE3,AH3,AK3,AN3,AQ3,AT3,AW3,AZ3,BC3,BF3)/COUNT(D3,G3,J3,M3,P3,S3,V3,Y3,AB3,AE3,AH3,AK3,AN3,AQ3,AT3,AW3,AZ3,BC3,BF3)","v":{"v":10.86724695386378,"d":"10.87"}}]
["г. Ярославль ГБУЗ ЯО \"Областная клиническая туберкулезная больница\"",null,100,{"$f":"IF(IFERROR(B4/C4,FALSE),B4/C4,\" \")","v":" "},null,100,{"$f":"IF(IFERROR(E4/F4,FALSE),E4/F4,\" \")","v":" "},null,1,{"$f":"IF(IFERROR(I4/H4,FALSE),I4/H4,\" \")","v":" "},null,1,{"$f":"IF(IFERROR(L4/K4,FALSE),L4/K4,\" \")","v":" "},63.8,53.1,{"$f":"IF(IFERROR(N4/O4,FALSE),N4/O4,\" \")","v":{"v":1.2015065913370997,"d":"1.202"}},59.7,{"v":67.3,"d":"67.30"},{"$f":"IF(IFERROR(Q4/R4,FALSE),Q4/R4,\" \")","v":{"v":0.887072808320951,"d":"0.887"}},9166.5,20012.2,{"$f":"IF(IFERROR(T4/U4,FALSE),T4/U4,\" \")","v":0.45804559218876484},1626101.2,3011855,{"$f":"IF(IFERROR(W4/X4,FALSE),W4/X4,\" \")","v":0.5399002276005983},97.5,100,{"$f":"IF(IFERROR(AA4/Z4,FALSE),AA4/Z4,\" \")","v":1.0256410256410255},108.7,100,{"$f":"IF(IFERROR(AC4/AD4,FALSE),AC4/AD4,\" \")","v":1.087},104.5,100,{"$f":"IF(IFERROR(AF4/AG4,FALSE),AF4/AG4,\" \")","v":1.045},null,100,{"$f":"IF(IFERROR(AJ4/AI4,FALSE),AJ4/AI4,\" \")","v":" "},null,0.4502797,{"$f":"IF(IFERROR(AL4/AM4,FALSE),AL4/AM4,\" \")","v":" "},null,0.1095192,{"$f":"IF(IFERROR(AP4/AO4,FALSE),AP4/AO4,\" \")","v":" "},6.3,2.2,{"$f":"IF(IFERROR(AS4/AR4,FALSE),AS4/AR4,\" \")","v":{"v":0.34920634920634924,"d":"0.349"}},301.8,309.5,{"$f":"IF(IFERROR(AU4/AV4,FALSE),AU4/AV4,\" \")","v":0.9751211631663974},6.7,1.1,{"$f":"IF(AX4<>\"\",IF(IFERROR(AY4/AX4,FALSE),AY4/AX4,1),\"\")","v":{"v":0.16417910447761194,"d":"0.164"}},2854.8,{"v":2789.2,"d":"2789"},{"$f":"IF(IFERROR(BA4/BB4,FALSE),BA4/BB4,\" \")","v":{"v":1.0235192886849278,"d":"1.024"}},null,1,{"$f":"IFERROR(BE4-0.25*BD4,\"\")","v":1},{"$f":"SUM(D4,G4,J4,M4,P4,S4,V4,Y4,AB4,AE4,AH4,AK4,AN4,AQ4,AT4,AW4,AZ4,BC4,BF4)/COUNT(D4,G4,J4,M4,P4,S4,V4,Y4,AB4,AE4,AH4,AK4,AN4,AQ4,AT4,AW4,AZ4,BC4,BF4)","v":{"v":0.8130160125519771,"d":"0.81"}},{"$f":"IF(INDEX('Рейтинг 4 гр'!A6:C19,MATCH(A4,'Рейтинг 4 гр'!$B$3:$B$16,0),3)>=0,INDEX('Рейтинг 4 гр'!$A$3:$C$16,MATCH(A4,'Рейтинг 4 гр'!$B$3:$B$16,0),1),\"Дискв.\")","v":12}]
["г. Ярославль ГБУЗ ЯО \"Областной врачебно-физкультурный диспансер\"",null,100," ",null,100," ",null,1," ",null,1," ",63,53.1,{"v":1.1864406779661016,"d":"1.186"},21.4,{"v":67.3,"d":"67.30"},{"v":0.3179791976225854,"d":"0.318"},1321.9,20012.2,0.06605470662895634,63322.2,3011855,0.021024318899814234,null,100," ",null,100," ",104,100,1.04,null,100," ",null,0.4502797," ",null,0.1095192," ",0,2.2," ",null,309.5," ",null,1.1,"",2700.1,{"v":2789.2,"d":"2789"},{"v":0.9680553563745877,"d":"0.968"},null,1,1,{"v":0.6570791796417207,"d":"0.66"},{"$f":"IF(INDEX('Рейтинг 4 гр'!A7:C20,MATCH(A5,'Рейтинг 4 гр'!$B$3:$B$16,0),3)>=0,INDEX('Рейтинг 4 гр'!$A$3:$C$16,MATCH(A5,'Рейтинг 4 гр'!$B$3:$B$16,0),1),\"Дискв.\")","v":13}]
["г. Ярославль ГБУЗ ЯО \"Областной кожно-венерологический диспансер\"",null,100," ",null,100," ",null,1," ",null,1," ",81.8,53.1,{"v":1.5404896421845573,"d":"1.540"},17.8,{"v":67.3,"d":"67.30"},{"v":0.26448736998514116,"d":"0.264"},10703.8,20012.2,0.534863733122795,1692181.2,3011855,0.5618401948300964,88.8,100,1.1261261261261262,101.2,100,1.012,80.6,100,0.8059999999999999,null,100," ",null,0.4502797," ",null,0.1095192," ",0.1,2.2,{"v":22,"d":"22.000"},279.7,309.5,0.9037156704361874,null,1.1,"",3229.6,{"v":2789.2,"d":"2789"},{"v":1.1578947368421053,"d":"1.158"},null,1,1,{"v":2.809765224866092,"d":"2.81"},{"$f":"IF(INDEX('Рейтинг 4 гр'!A8:C21,MATCH(A6,'Рейтинг 4 гр'!$B$3:$B$16,0),3)>=0,INDEX('Рейтинг 4 гр'!$A$3:$C$16,MATCH(A6,'Рейтинг 4 гр'!$B$3:$B$16,0),1),\"Дискв.\")","v":6}]
["г. Ярославль ГБУЗ ЯО \"Ярославская областная клиническая наркологическая больница\"",null,100," ",null,100," ",null,1," ",null,1," ",55.6,53.1,{"v":1.0470809792843692,"d":"1.047"},23.3,{"v":67.3,"d":"67.30"},{"v":0.34621099554234774,"d":"0.346"},6476.3,20012.2,0.32361759326810646,348722.2,3011855,0.11578319673423854,104.6,100,0.9560229445506693,null,100," ",266.2,100,2.662,null,100," ",null,0.4502797," ",null,0.1095192," ",0.2,2.2,{"v":11,"d":"11.000"},345.4,309.5,1.1159935379644588,null,1.1,"",3427.9,{"v":2789.2,"d":"2789"},{"v":1.2289903915101106,"d":"1.229"},null,1,1,{"v":1.9795699638854298,"d":"1.98"},{"$f":"IF(INDEX('Рейтинг 4 гр'!A10:C23,MATCH(A7,'Рейтинг 4 гр'!$B$3:$B$16,0),3)>=0,INDEX('Рейтинг 4 гр'!$A$3:$C$16,MATCH(A7,'Рейтинг 4 гр'!$B$3:$B$16,0),1),\"Дискв.\")","v":4}]
["г. Ярославль ГБУЗ ЯО \"Ярославская областная клиническая психиатрическая больница\"",null,100," ",null,100," ",null,1," ",null,1," ",61,53.1,{"v":1.1487758945386064,"d":"1.149"},17.7,{"v":67.3,"d":"67.30"},{"v":0.26300148588410105,"d":"0.263"},8959.1,20012.2,0.44768191403244023,1976783.4,3011855,0.6563341860746948,97.7,100,1.0235414534288638,101.7,100,1.0170000000000001,168.6,100,1.686,83.3,100,1.2004801920768309,null,0.4502797," ",null,0.1095192," ",2.3,2.2,{"v":0.9565217391304349,"d":"0.957"},313.6,309.5,1.0132471728594508,null,1.1,"",2900.3,{"v":2789.2,"d":"2789"},{"v":1.0398322099526747,"d":"1.040"},null,1,1,{"v":0.9543680206648415,"d":"0.95"},{"$f":"IF(INDEX('Рейтинг 4 гр'!A11:C24,MATCH(A8,'Рейтинг 4 гр'!$B$3:$B$16,0),3)>=0,INDEX('Рейтинг 4 гр'!$A$3:$C$16,MATCH(A8,'Рейтинг 4 гр'!$B$3:$B$16,0),1),\"Дискв.\")","v":9}]
["г. Рыбинск ГКУЗ ЯО \"Рыбинский противотуберкулезный диспансер\"",null,100," ",null,100," ",null,1," ",null,1," ",55.6,53.1,{"v":1.0470809792843692,"d":"1.047"},17.6,{"v":67.3,"d":"67.30"},{"v":0.26151560178306094,"d":"0.262"},8617.3,20012.2,0.4306023325771279,2692422.2,3011855,0.8939415078083109,47.5,100,2.1052631578947367,null,100," ",73,100,0.73,null,100," ",null,0.4502797," ",null,0.1095192," ",5.5,2.2,{"v":0.4,"d":"0.400"},218.7,309.5,0.7066235864297253,null,1.1,"",1688.2,{"v":2789.2,"d":"2789"},{"v":0.605263157894737,"d":"0.605"},null,1,1,{"v":0.8180290323672068,"d":"0.82"},{"$f":"IF(INDEX('Рейтинг 4 гр'!A13:C26,MATCH(A9,'Рейтинг 4 гр'!$B$3:$B$16,0),3)>=0,INDEX('Рейтинг 4 гр'!$A$3:$C$16,MATCH(A9,'Рейтинг 4 гр'!$B$3:$B$16,0),1),\"Дискв.\")","v":14}]
["г. Рыбинск ГКУЗ ЯО \"Рыбинская психиатрическая больница\"",null,100," ",null,100," ",null,1," ",null,1," ",60.9,53.1,{"v":1.1468926553672316,"d":"1.147"},0,{"v":67.3,"d":"67.30"}," ",4893.9,20012.2,0.2445458270455022,1200230.3,3011855,0.398502019519532,89.6,100,1.1160714285714286,107,100,1.07,131.9,100,1.319,100.8,100,0.9920634920634921,null,0.4502797," ",null,0.1095192," ",0.8,2.2,{"v":2.75,"d":"2.750"},322.5,309.5,1.0420032310177707,null,1.1,"",3881.9,{"v":2789.2,"d":"2789"},{"v":1.3917610784454324,"d":"1.392"},null,1,1,{"v":1.1337127029118537,"d":"1.13"},{"$f":"IF(INDEX('Рейтинг 4 гр'!A14:C27,MATCH(A10,'Рейтинг 4 гр'!$B$3:$B$16,0),3)>=0,INDEX('Рейтинг 4 гр'!$A$3:$C$16,MATCH(A10,'Рейтинг 4 гр'!$B$3:$B$16,0),1),\"Дискв.\")","v":10}]
["г. Ярославль ГУЗ ЯО \"Центр СПИД\"",null,100," ",null,100," ",null,1," ",null,1," ",84.2,53.1,{"v":1.585687382297552,"d":"1.586"},40,{"v":67.3,"d":"67.30"},{"v":0.5943536404160475,"d":"0.594"},31118.6,20012.2,1.5549814613086017,1072773.7,3011855,0.3561837140234174,null,100," ",null,100," ",127.2,100,1.272,null,100," ",null,0.4502797," ",null,0.1095192,{"$f":"IF(IFERROR(AP11/AO11,FALSE),AP11/AO11,\" \")","v":" "},0,2.2," ",null,309.5," ",null,1.1,"",1085.1,{"v":2789.2,"d":"2789"},{"v":0.3890362828051054,"d":"0.389"},null,1,1,{"v":0.9646060686929606,"d":"0.96"},{"$f":"IF(INDEX('Рейтинг 4 гр'!A16:C29,MATCH(A11,'Рейтинг 4 гр'!$B$3:$B$16,0),3)>=0,INDEX('Рейтинг 4 гр'!$A$3:$C$16,MATCH(A11,'Рейтинг 4 гр'!$B$3:$B$16,0),1),\"Дискв.\")","v":7}]

{"sheet":"рейтинг 5 гр","index":5,"n_rows":0,"n_cols":0,"rows_kept":0,"hidden":true}